Bug 443208 - Build failure with aqbanking 6.3.2
Summary: Build failure with aqbanking 6.3.2
Status: RESOLVED FIXED
Alias: None
Product: kmymoney
Classification: Unclassified
Component: general (show other bugs)
Version: 5.1.2
Platform: Other Other
: NOR normal (vote)
Target Milestone: ---
Assignee: KMyMoney Devel Mailing List
URL:
Keywords:
Depends on:
Blocks:
 
Reported: 2021-10-01 20:14 UTC by Christophe Giboudeaux
Modified: 2021-10-03 10:59 UTC (History)
0 users

See Also:
Latest Commit:
Version Fixed In: 5.1.3


Attachments

Note You need to log in before you can comment on or make changes to this bug.
Description Christophe Giboudeaux 2021-10-01 20:14:11 UTC
Log below. the failure happens with the stable version and git master.

[  489s] In file included from /usr/include/qt5/QtCore/qglobal.h:1299,
[  489s]                  from /usr/include/qt5/QtGui/qtguiglobal.h:43,
[  489s]                  from /usr/include/qt5/QtWidgets/qtwidgetsglobal.h:43,
[  489s]                  from /usr/include/qt5/QtWidgets/qdialog.h:43,
[  489s]                  from /usr/include/qt5/QtWidgets/QDialog:1,
[  489s]                  from /home/abuild/rpmbuild/BUILD/kmymoney-5.1.80git1565~b3520dc1d/kmymoney/plugins/kbanking/dialogs/kbmapaccount.h:11,
[  489s]                  from /home/abuild/rpmbuild/BUILD/kmymoney-5.1.80git1565~b3520dc1d/kmymoney/plugins/kbanking/dialogs/kbmapaccount.cpp:15:
[  489s] /usr/include/qt5/QtCore/qflags.h:123:80: note: declared here
[  489s]   123 |     QT_DEPRECATED_X("Use default constructor instead") Q_DECL_CONSTEXPR inline QFlags(Zero) noexcept : i(0) {}
[  489s]       |                                                                                ^~~~~~
[  489s] In file included from /home/abuild/rpmbuild/BUILD/kmymoney-5.1.80git1565~b3520dc1d/kmymoney/plugins/kbanking/dialogs/kbmapaccount.cpp:17:
[  489s] /home/abuild/rpmbuild/BUILD/kmymoney-5.1.80git1565~b3520dc1d/kmymoney/plugins/kbanking/dialogs/../kbanking.h:166:49: error: expected ';' at end of member declaration
[  489s]   166 |     bool updateAccount(const MyMoneyAccount& acc) DEPRECATED;
[  489s]       |                                                 ^
[  489s]       |                                                  ;
[  489s] /home/abuild/rpmbuild/BUILD/kmymoney-5.1.80git1565~b3520dc1d/kmymoney/plugins/kbanking/dialogs/../kbanking.h:166:51: error: 'DEPRECATED' does not name a type; did you mean 'QT_DEPRECATED'?
[  489s]   166 |     bool updateAccount(const MyMoneyAccount& acc) DEPRECATED;
[  489s]       |                                                   ^~~~~~~~~~
[  489s]       |                                                   QT_DEPRECATED
[  489s] make[2]: *** [kmymoney/plugins/kbanking/dialogs/CMakeFiles/kbanking_dialogs.dir/build.make:130: kmymoney/plugins/kbanking/dialogs/CMakeFiles/kbanking_dialogs.dir/kbmapaccount.cpp.o] Error 1
[  489s] make[2]: Leaving directory '/home/abuild/rpmbuild/BUILD/kmymoney-5.1.80git1565~b3520dc1d/build'
[  489s] make[1]: *** [CMakeFiles/Makefile2:3932: kmymoney/plugins/kbanking/dialogs/CMakeFiles/kbanking_dialogs.dir/all] Error 2
[  489s] make[1]: *** Waiting for unfinished jobs....