Bug 440768 - 5.105.0 test suite is failing
Summary: 5.105.0 test suite is failing
Status: RESOLVED FIXED
Alias: None
Product: libplasma
Classification: Frameworks and Libraries
Component: components (show other bugs)
Version: 5.105.0
Platform: Other Other
: NOR normal
Target Milestone: ---
Assignee: Marco Martin
URL:
Keywords:
Depends on:
Blocks:
 
Reported: 2021-08-09 06:37 UTC by kloczek
Modified: 2023-12-13 10:50 UTC (History)
3 users (show)

See Also:
Latest Commit:
Version Fixed In:
Sentry Crash Report:


Attachments

Note You need to log in before you can comment on or make changes to this bug.
Description kloczek 2021-08-09 06:37:19 UTC
+ cd plasma-framework-5.84.0
+ xvfb-run -a /usr/bin/make -O -j48 V=1 VERBOSE=1 -C x86_64-redhat-linux-gnu test ARGS=--output-on-failure
make: Entering directory '/home/tkloczko/rpmbuild/BUILD/plasma-framework-5.84.0/x86_64-redhat-linux-gnu'
Running tests...
/usr/bin/ctest --force-new-ctest-process --output-on-failure
Test project /home/tkloczko/rpmbuild/BUILD/plasma-framework-5.84.0/x86_64-redhat-linux-gnu
      Start  1: appstreamtest
 1/12 Test  #1: appstreamtest ....................   Passed    0.04 sec
      Start  2: plasma-dialogqmltest
 2/12 Test  #2: plasma-dialogqmltest .............   Passed    0.37 sec
      Start  3: plasma-dialogstatetest
 3/12 Test  #3: plasma-dialogstatetest ...........***Failed    5.43 sec
********* Start testing of DialogStateTest *********
Config: Using QtTest library 5.15.2, Qt 5.15.2 (x86_64-little_endian-lp64 shared (dynamic) release build; by GCC 11.1.1 20210623 (Red Hat 11.1.1-6)), fedora 35
PASS   : DialogStateTest::initTestCase()
QWARN  : DialogStateTest::windowState() qt.qpa.xcb: QXcbConnection: XCB error: 2 (BadValue), sequence: 512, resource id: 0, major code: 53 (CreatePixmap), minor code: 0
QWARN  : DialogStateTest::windowState() qt.qpa.xcb: QXcbConnection: XCB error: 9 (BadDrawable), sequence: 513, resource id: 2097169, major code: 55 (CreateGC), minor code: 0
QWARN  : DialogStateTest::windowState() qt.qpa.xcb: QXcbConnection: XCB error: 9 (BadDrawable), sequence: 514, resource id: 2097169, major code: 72 (PutImage), minor code: 0
QWARN  : DialogStateTest::windowState() qt.qpa.xcb: QXcbConnection: XCB error: 2 (BadValue), sequence: 515, resource id: 0, major code: 53 (CreatePixmap), minor code: 0
QWARN  : DialogStateTest::windowState() qt.qpa.xcb: QXcbConnection: XCB error: 9 (BadDrawable), sequence: 516, resource id: 2097171, major code: 55 (CreateGC), minor code: 0
QWARN  : DialogStateTest::windowState() qt.qpa.xcb: QXcbConnection: XCB error: 9 (BadDrawable), sequence: 517, resource id: 2097171, major code: 72 (PutImage), minor code: 0
QWARN  : DialogStateTest::windowState() qt.qpa.xcb: QXcbConnection: XCB error: 2 (BadValue), sequence: 518, resource id: 0, major code: 53 (CreatePixmap), minor code: 0
QWARN  : DialogStateTest::windowState() qt.qpa.xcb: QXcbConnection: XCB error: 9 (BadDrawable), sequence: 519, resource id: 2097173, major code: 55 (CreateGC), minor code: 0
QWARN  : DialogStateTest::windowState() qt.qpa.xcb: QXcbConnection: XCB error: 9 (BadDrawable), sequence: 520, resource id: 2097173, major code: 72 (PutImage), minor code: 0
QWARN  : DialogStateTest::windowState() qt.qpa.xcb: QXcbConnection: XCB error: 2 (BadValue), sequence: 521, resource id: 0, major code: 53 (CreatePixmap), minor code: 0
QWARN  : DialogStateTest::windowState() qt.qpa.xcb: QXcbConnection: XCB error: 9 (BadDrawable), sequence: 522, resource id: 2097175, major code: 55 (CreateGC), minor code: 0
QWARN  : DialogStateTest::windowState() qt.qpa.xcb: QXcbConnection: XCB error: 9 (BadDrawable), sequence: 523, resource id: 2097175, major code: 72 (PutImage), minor code: 0
QWARN  : DialogStateTest::windowState() qt.qpa.xcb: QXcbConnection: XCB error: 2 (BadValue), sequence: 524, resource id: 0, major code: 53 (CreatePixmap), minor code: 0
QWARN  : DialogStateTest::windowState() qt.qpa.xcb: QXcbConnection: XCB error: 9 (BadDrawable), sequence: 525, resource id: 2097177, major code: 55 (CreateGC), minor code: 0
QWARN  : DialogStateTest::windowState() qt.qpa.xcb: QXcbConnection: XCB error: 9 (BadDrawable), sequence: 526, resource id: 2097177, major code: 72 (PutImage), minor code: 0
QWARN  : DialogStateTest::windowState() qt.qpa.xcb: QXcbConnection: XCB error: 2 (BadValue), sequence: 527, resource id: 0, major code: 53 (CreatePixmap), minor code: 0
QWARN  : DialogStateTest::windowState() qt.qpa.xcb: QXcbConnection: XCB error: 9 (BadDrawable), sequence: 528, resource id: 2097179, major code: 55 (CreateGC), minor code: 0
QWARN  : DialogStateTest::windowState() qt.qpa.xcb: QXcbConnection: XCB error: 9 (BadDrawable), sequence: 529, resource id: 2097179, major code: 72 (PutImage), minor code: 0
QWARN  : DialogStateTest::windowState() qt.qpa.xcb: QXcbConnection: XCB error: 2 (BadValue), sequence: 530, resource id: 0, major code: 53 (CreatePixmap), minor code: 0
QWARN  : DialogStateTest::windowState() qt.qpa.xcb: QXcbConnection: XCB error: 9 (BadDrawable), sequence: 531, resource id: 2097181, major code: 55 (CreateGC), minor code: 0
QWARN  : DialogStateTest::windowState() qt.qpa.xcb: QXcbConnection: XCB error: 9 (BadDrawable), sequence: 532, resource id: 2097181, major code: 72 (PutImage), minor code: 0
QWARN  : DialogStateTest::windowState() qt.qpa.xcb: QXcbConnection: XCB error: 2 (BadValue), sequence: 533, resource id: 0, major code: 53 (CreatePixmap), minor code: 0
QWARN  : DialogStateTest::windowState() qt.qpa.xcb: QXcbConnection: XCB error: 9 (BadDrawable), sequence: 534, resource id: 2097183, major code: 55 (CreateGC), minor code: 0
QWARN  : DialogStateTest::windowState() qt.qpa.xcb: QXcbConnection: XCB error: 9 (BadDrawable), sequence: 535, resource id: 2097183, major code: 72 (PutImage), minor code: 0
FAIL!  : DialogStateTest::windowState() 'windowAddedSpy.wait()' returned FALSE. ()
   Loc: [/home/tkloczko/rpmbuild/BUILD/plasma-framework-5.84.0/autotests/dialogstatetest.cpp(37)]
PASS   : DialogStateTest::cleanupTestCase()
Totals: 2 passed, 1 failed, 0 skipped, 0 blacklisted, 5318ms
********* Finished testing of DialogStateTest *********

      Start  4: plasma-pluginloadertest
 4/12 Test  #4: plasma-pluginloadertest ..........   Passed    0.29 sec
      Start  5: plasma-framesvgtest
 5/12 Test  #5: plasma-framesvgtest ..............   Passed    0.13 sec
      Start  6: plasma-iconitemtest
 6/12 Test  #6: plasma-iconitemtest ..............   Passed    1.54 sec
      Start  7: plasma-themetest
 7/12 Test  #7: plasma-themetest .................   Passed    0.42 sec
      Start  8: plasma-configmodeltest
 8/12 Test  #8: plasma-configmodeltest ...........   Passed    0.12 sec
      Start  9: dialognativetest
 9/12 Test  #9: dialognativetest .................   Passed    0.38 sec
      Start 10: coronatest
10/12 Test #10: coronatest .......................   Passed    0.41 sec
      Start 11: plasma-sortfiltermodeltest
11/12 Test #11: plasma-sortfiltermodeltest .......   Passed    0.09 sec
      Start 12: i18ndcheck
12/12 Test #12: i18ndcheck .......................   Passed    0.02 sec

92% tests passed, 1 tests failed out of 12

Total Test time (real) =   9.26 sec

The following tests FAILED:
          3 - plasma-dialogstatetest (Failed)
Errors while running CTest
Comment 1 Nate Graham 2021-08-09 16:32:17 UTC
Yeah there are a bunch of failing tests for me too, but it seems like nobody will care until we get gitlab CI. :(
Comment 2 kloczek 2023-02-15 06:35:25 UTC
Any update?

5.103.0 still is failing

+ cd plasma-framework-5.103.0
+ xvfb-run -a /usr/bin/ctest --test-dir x86_64-redhat-linux-gnu --output-on-failure --force-new-ctest-process -j48 ' '
Internal ctest changing into directory: /home/tkloczko/rpmbuild/BUILD/plasma-framework-5.103.0/x86_64-redhat-linux-gnu
Test project /home/tkloczko/rpmbuild/BUILD/plasma-framework-5.103.0/x86_64-redhat-linux-gnu
      Start  1: plasma-dialogqmltest
      Start  2: plasma-dialogstatetest
      Start  3: plasma-pluginloadertest
      Start  4: plasma-framesvgtest
      Start  5: plasma-iconitemtest
      Start  6: plasma-themetest
      Start  7: plasma-configmodeltest
      Start  8: dialognativetest
      Start  9: iconitemhidpitest
      Start 10: coronatest
      Start 11: plasma-sortfiltermodeltest
      Start 12: i18ndcheck
 1/12 Test #12: i18ndcheck .......................   Passed    0.01 sec
 2/12 Test #10: coronatest .......................   Passed    0.09 sec
 3/12 Test #11: plasma-sortfiltermodeltest .......   Passed    0.09 sec
 4/12 Test  #7: plasma-configmodeltest ...........   Passed    0.11 sec
 5/12 Test  #1: plasma-dialogqmltest .............   Passed    0.16 sec
 6/12 Test  #8: dialognativetest .................***Failed    0.15 sec
********* Start testing of DialogNativeTest *********
Config: Using QtTest library 5.15.8, Qt 5.15.8 (x86_64-little_endian-lp64 shared (dynamic) release build; by GCC 13.0.1 20230127 (Red Hat 13.0.1-0)), fedora 39
WARNING: DialogNativeTest::initTestCase() testdata ../src/desktoptheme/breeze/colors could not be located!
   Loc: [/home/tkloczko/rpmbuild/BUILD/plasma-framework-5.103.0/autotests/utils.h(51)]
PASS   : DialogNativeTest::initTestCase()
FAIL!  : DialogNativeTest::size() Compared values are not the same
   Actual   (m_dialog->height()): 111
   Expected (112)               : 112
   Loc: [/home/tkloczko/rpmbuild/BUILD/plasma-framework-5.103.0/autotests/dialognativetest.cpp(72)]
PASS   : DialogNativeTest::position()
PASS   : DialogNativeTest::cleanupTestCase()
Totals: 3 passed, 1 failed, 0 skipped, 0 blacklisted, 62ms
********* Finished testing of DialogNativeTest *********

 7/12 Test  #4: plasma-framesvgtest ..............   Passed    0.16 sec
 8/12 Test  #9: iconitemhidpitest ................   Passed    0.15 sec
 9/12 Test  #3: plasma-pluginloadertest ..........   Passed    0.17 sec
10/12 Test  #6: plasma-themetest .................   Passed    1.03 sec
11/12 Test  #5: plasma-iconitemtest ..............***Failed    1.43 sec
********* Start testing of IconItemTest *********
Config: Using QtTest library 5.15.8, Qt 5.15.8 (x86_64-little_endian-lp64 shared (dynamic) release build; by GCC 13.0.1 20230127 (Red Hat 13.0.1-0)), fedora 39
WARNING: IconItemTest::initTestCase() testdata ../src/desktoptheme/breeze/colors could not be located!
   Loc: [/home/tkloczko/rpmbuild/BUILD/plasma-framework-5.103.0/autotests/utils.h(51)]
PASS   : IconItemTest::initTestCase()
PASS   : IconItemTest::loadPixmap()
PASS   : IconItemTest::loadImage()
PASS   : IconItemTest::invalidIcon()
PASS   : IconItemTest::usesPlasmaTheme()
FAIL!  : IconItemTest::animation() 'userAwayImg != waitAndGrabImage(item1)' returned FALSE. ()
   Loc: [/home/tkloczko/rpmbuild/BUILD/plasma-framework-5.103.0/autotests/iconitemtest.cpp(243)]
FAIL!  : IconItemTest::animationAfterHide() 'userBusyImg != waitAndGrabImage(item1)' returned FALSE. ()
   Loc: [/home/tkloczko/rpmbuild/BUILD/plasma-framework-5.103.0/autotests/iconitemtest.cpp(277)]
SKIP   : IconItemTest::bug_359388() hicolor icon theme not available
   Loc: [/home/tkloczko/rpmbuild/BUILD/plasma-framework-5.103.0/autotests/iconitemtest.cpp(284)]
PASS   : IconItemTest::loadSvg()
PASS   : IconItemTest::themeChange()
PASS   : IconItemTest::qiconFromTheme()
PASS   : IconItemTest::changeColorGroup()
FAIL!  : IconItemTest::animatingActiveChange() 'img1 != img2' returned FALSE. ()
   Loc: [/home/tkloczko/rpmbuild/BUILD/plasma-framework-5.103.0/autotests/iconitemtest.cpp(413)]
FAIL!  : IconItemTest::animatingEnabledChange() 'img1 != img2' returned FALSE. ()
   Loc: [/home/tkloczko/rpmbuild/BUILD/plasma-framework-5.103.0/autotests/iconitemtest.cpp(432)]
PASS   : IconItemTest::windowChanged()
PASS   : IconItemTest::paintedSize()
PASS   : IconItemTest::implicitSize()
PASS   : IconItemTest::nonSquareImplicitSize()
PASS   : IconItemTest::roundToIconSize()
PASS   : IconItemTest::cleanupTestCase()
Totals: 15 passed, 4 failed, 1 skipped, 0 blacklisted, 1344ms
********* Finished testing of IconItemTest *********

12/12 Test  #2: plasma-dialogstatetest ...........***Failed    5.40 sec
********* Start testing of DialogStateTest *********
Config: Using QtTest library 5.15.8, Qt 5.15.8 (x86_64-little_endian-lp64 shared (dynamic) release build; by GCC 13.0.1 20230127 (Red Hat 13.0.1-0)), fedora 39
QWARN  : DialogStateTest::initTestCase() kf.plasma.core: Could not locate plasma theme "default" in plasma/desktoptheme/ using search path ("/home/tkloczko/.local/share", "/usr/local/share", "/usr/share")
QWARN  : DialogStateTest::initTestCase() kf.plasma.core: Could not locate plasma theme "default" in plasma/desktoptheme/ using search path ("/home/tkloczko/.local/share", "/usr/local/share", "/usr/share")
PASS   : DialogStateTest::initTestCase()
FAIL!  : DialogStateTest::windowState() 'windowAddedSpy.wait()' returned FALSE. ()
   Loc: [/home/tkloczko/rpmbuild/BUILD/plasma-framework-5.103.0/autotests/dialogstatetest.cpp(39)]
PASS   : DialogStateTest::cleanupTestCase()
Totals: 2 passed, 1 failed, 0 skipped, 0 blacklisted, 5290ms
********* Finished testing of DialogStateTest *********


75% tests passed, 3 tests failed out of 12

Total Test time (real) =   5.40 sec

The following tests FAILED:
          2 - plasma-dialogstatetest (Failed)
          5 - plasma-iconitemtest (Failed)
          8 - dialognativetest (Failed)
Errors while running CTest


What is new that after exclude those units another on is poping out (some depenedencies between units?)


+ xvfb-run -a /usr/bin/ctest --test-dir x86_64-redhat-linux-gnu --output-on-failure --force-new-ctest-process -j48 ' ' -E '^(plasma-dialogstatetest|plasma-iconitemtest|dialognativetest)'
Internal ctest changing into directory: /home/tkloczko/rpmbuild/BUILD/plasma-framework-5.103.0/x86_64-redhat-linux-gnu
Test project /home/tkloczko/rpmbuild/BUILD/plasma-framework-5.103.0/x86_64-redhat-linux-gnu
    Start 1: plasma-dialogqmltest
    Start 2: plasma-pluginloadertest
    Start 3: plasma-framesvgtest
    Start 4: plasma-themetest
    Start 5: plasma-configmodeltest
    Start 6: iconitemhidpitest
    Start 7: coronatest
    Start 8: plasma-sortfiltermodeltest
    Start 9: i18ndcheck
1/9 Test #9: i18ndcheck .......................   Passed    0.01 sec
2/9 Test #7: coronatest .......................   Passed    0.08 sec
3/9 Test #8: plasma-sortfiltermodeltest .......   Passed    0.08 sec
4/9 Test #5: plasma-configmodeltest ...........   Passed    0.10 sec
5/9 Test #3: plasma-framesvgtest ..............   Passed    0.12 sec
6/9 Test #2: plasma-pluginloadertest ..........   Passed    0.14 sec
7/9 Test #1: plasma-dialogqmltest .............   Passed    0.16 sec
8/9 Test #6: iconitemhidpitest ................   Passed    0.16 sec
9/9 Test #4: plasma-themetest .................***Failed    5.09 sec
********* Start testing of ThemeTest *********
Config: Using QtTest library 5.15.8, Qt 5.15.8 (x86_64-little_endian-lp64 shared (dynamic) release build; by GCC 13.0.1 20230127 (Red Hat 13.0.1-0)), fedora 39
PASS   : ThemeTest::initTestCase()
FAIL!  : ThemeTest::loadSvgIcon() 'spy.count() == 1' returned FALSE. ()
   Loc: [/home/tkloczko/rpmbuild/BUILD/plasma-framework-5.103.0/autotests/themetest.cpp(121)]
PASS   : ThemeTest::testThemeConfig(new metadata style theme)
PASS   : ThemeTest::testThemeConfig(old metadata format theme)
PASS   : ThemeTest::testColors()
PASS   : ThemeTest::testCompositingChange()
PASS   : ThemeTest::cleanupTestCase()
Totals: 6 passed, 1 failed, 0 skipped, 0 blacklisted, 5012ms
********* Finished testing of ThemeTest *********


89% tests passed, 1 tests failed out of 9

Total Test time (real) =   5.11 sec

The following tests FAILED:
          4 - plasma-themetest (Failed)
Errors while running CTest
Comment 3 kloczek 2023-04-08 22:53:33 UTC
Gentle ping .. just retested 5.105.0 and still i see test suite is failing

+ cd plasma-framework-5.105.0
+ xvfb-run -a /usr/bin/ctest --test-dir x86_64-redhat-linux-gnu --output-on-failure --force-new-ctest-process -j48 ' '
Internal ctest changing into directory: /home/tkloczko/rpmbuild/BUILD/plasma-framework-5.105.0/x86_64-redhat-linux-gnu
Test project /home/tkloczko/rpmbuild/BUILD/plasma-framework-5.105.0/x86_64-redhat-linux-gnu
      Start  1: plasma-dialogqmltest
      Start  2: plasma-dialogstatetest
      Start  3: plasma-pluginloadertest
      Start  4: plasma-framesvgtest
      Start  5: plasma-iconitemtest
      Start  6: plasma-themetest
      Start  7: plasma-configmodeltest
      Start  8: dialognativetest
      Start  9: iconitemhidpitest
      Start 10: coronatest
      Start 11: plasma-sortfiltermodeltest
      Start 12: i18ndcheck
 1/12 Test #12: i18ndcheck .......................   Passed    0.01 sec
 2/12 Test #11: plasma-sortfiltermodeltest .......   Passed    0.09 sec
 3/12 Test #10: coronatest .......................   Passed    0.10 sec
 4/12 Test  #7: plasma-configmodeltest ...........   Passed    0.12 sec
 5/12 Test  #4: plasma-framesvgtest ..............   Passed    0.15 sec
 6/12 Test  #3: plasma-pluginloadertest ..........   Passed    0.16 sec
 7/12 Test  #1: plasma-dialogqmltest .............   Passed    0.18 sec
 8/12 Test  #8: dialognativetest .................***Failed    0.17 sec
********* Start testing of DialogNativeTest *********
Config: Using QtTest library 5.15.8, Qt 5.15.8 (x86_64-little_endian-lp64 shared (dynamic) release build; by GCC 13.0.1 20230324 (Red Hat 13.0.1-0)), fedora 39
WARNING: DialogNativeTest::initTestCase() testdata ../src/desktoptheme/breeze/colors could not be located!
   Loc: [/home/tkloczko/rpmbuild/BUILD/plasma-framework-5.105.0/autotests/utils.h(51)]
PASS   : DialogNativeTest::initTestCase()
FAIL!  : DialogNativeTest::size() Compared values are not the same
   Actual   (m_dialog->height()): 111
   Expected (112)               : 112
   Loc: [/home/tkloczko/rpmbuild/BUILD/plasma-framework-5.105.0/autotests/dialognativetest.cpp(72)]
PASS   : DialogNativeTest::position()
PASS   : DialogNativeTest::cleanupTestCase()
Totals: 3 passed, 1 failed, 0 skipped, 0 blacklisted, 74ms
********* Finished testing of DialogNativeTest *********

 9/12 Test  #9: iconitemhidpitest ................   Passed    0.18 sec
10/12 Test  #6: plasma-themetest .................   Passed    1.06 sec
11/12 Test  #5: plasma-iconitemtest ..............***Failed    1.47 sec
********* Start testing of IconItemTest *********
Config: Using QtTest library 5.15.8, Qt 5.15.8 (x86_64-little_endian-lp64 shared (dynamic) release build; by GCC 13.0.1 20230324 (Red Hat 13.0.1-0)), fedora 39
WARNING: IconItemTest::initTestCase() testdata ../src/desktoptheme/breeze/colors could not be located!
   Loc: [/home/tkloczko/rpmbuild/BUILD/plasma-framework-5.105.0/autotests/utils.h(51)]
PASS   : IconItemTest::initTestCase()
PASS   : IconItemTest::loadPixmap()
PASS   : IconItemTest::loadImage()
PASS   : IconItemTest::invalidIcon()
PASS   : IconItemTest::usesPlasmaTheme()
FAIL!  : IconItemTest::animation() 'userAwayImg != waitAndGrabImage(item1)' returned FALSE. ()
   Loc: [/home/tkloczko/rpmbuild/BUILD/plasma-framework-5.105.0/autotests/iconitemtest.cpp(243)]
FAIL!  : IconItemTest::animationAfterHide() 'userBusyImg != waitAndGrabImage(item1)' returned FALSE. ()
   Loc: [/home/tkloczko/rpmbuild/BUILD/plasma-framework-5.105.0/autotests/iconitemtest.cpp(277)]
SKIP   : IconItemTest::bug_359388() hicolor icon theme not available
   Loc: [/home/tkloczko/rpmbuild/BUILD/plasma-framework-5.105.0/autotests/iconitemtest.cpp(284)]
PASS   : IconItemTest::loadSvg()
PASS   : IconItemTest::themeChange()
PASS   : IconItemTest::qiconFromTheme()
PASS   : IconItemTest::changeColorGroup()
FAIL!  : IconItemTest::animatingActiveChange() 'img1 != img2' returned FALSE. ()
   Loc: [/home/tkloczko/rpmbuild/BUILD/plasma-framework-5.105.0/autotests/iconitemtest.cpp(413)]
FAIL!  : IconItemTest::animatingEnabledChange() 'img1 != img2' returned FALSE. ()
   Loc: [/home/tkloczko/rpmbuild/BUILD/plasma-framework-5.105.0/autotests/iconitemtest.cpp(432)]
PASS   : IconItemTest::windowChanged()
PASS   : IconItemTest::paintedSize()
PASS   : IconItemTest::implicitSize()
PASS   : IconItemTest::nonSquareImplicitSize()
PASS   : IconItemTest::roundToIconSize()
PASS   : IconItemTest::cleanupTestCase()
Totals: 15 passed, 4 failed, 1 skipped, 0 blacklisted, 1359ms
********* Finished testing of IconItemTest *********

12/12 Test  #2: plasma-dialogstatetest ...........***Failed    5.18 sec
********* Start testing of DialogStateTest *********
Config: Using QtTest library 5.15.8, Qt 5.15.8 (x86_64-little_endian-lp64 shared (dynamic) release build; by GCC 13.0.1 20230324 (Red Hat 13.0.1-0)), fedora 39
QWARN  : DialogStateTest::initTestCase() kf.plasma.core: Could not locate plasma theme "default" in plasma/desktoptheme/ using search path ("/home/tkloczko/.local/share", "/usr/local/share", "/usr/share")
QWARN  : DialogStateTest::initTestCase() kf.plasma.core: Could not locate plasma theme "default" in plasma/desktoptheme/ using search path ("/home/tkloczko/.local/share", "/usr/local/share", "/usr/share")
PASS   : DialogStateTest::initTestCase()
FAIL!  : DialogStateTest::windowState() 'windowAddedSpy.wait()' returned FALSE. ()
   Loc: [/home/tkloczko/rpmbuild/BUILD/plasma-framework-5.105.0/autotests/dialogstatetest.cpp(39)]
PASS   : DialogStateTest::cleanupTestCase()
Totals: 2 passed, 1 failed, 0 skipped, 0 blacklisted, 5067ms
********* Finished testing of DialogStateTest *********


75% tests passed, 3 tests failed out of 12

Total Test time (real) =   5.19 sec

The following tests FAILED:
          2 - plasma-dialogstatetest (Failed)
          5 - plasma-iconitemtest (Failed)
          8 - dialognativetest (Failed)
Errors while running CTest
+ cd plasma-framework-5.105.0
+ xvfb-run -a /usr/bin/ctest --test-dir x86_64-redhat-linux-gnu --output-on-failure --force-new-ctest-process -j48 ' '
Internal ctest changing into directory: /home/tkloczko/rpmbuild/BUILD/plasma-framework-5.105.0/x86_64-redhat-linux-gnu
Test project /home/tkloczko/rpmbuild/BUILD/plasma-framework-5.105.0/x86_64-redhat-linux-gnu
      Start  1: plasma-dialogqmltest
      Start  2: plasma-dialogstatetest
      Start  3: plasma-pluginloadertest
      Start  4: plasma-framesvgtest
      Start  5: plasma-iconitemtest
      Start  6: plasma-themetest
      Start  7: plasma-configmodeltest
      Start  8: dialognativetest
      Start  9: iconitemhidpitest
      Start 10: coronatest
      Start 11: plasma-sortfiltermodeltest
      Start 12: i18ndcheck
 1/12 Test #12: i18ndcheck .......................   Passed    0.01 sec
 2/12 Test #11: plasma-sortfiltermodeltest .......   Passed    0.09 sec
 3/12 Test #10: coronatest .......................   Passed    0.10 sec
 4/12 Test  #7: plasma-configmodeltest ...........   Passed    0.12 sec
 5/12 Test  #4: plasma-framesvgtest ..............   Passed    0.15 sec
 6/12 Test  #3: plasma-pluginloadertest ..........   Passed    0.16 sec
 7/12 Test  #1: plasma-dialogqmltest .............   Passed    0.18 sec
 8/12 Test  #8: dialognativetest .................***Failed    0.17 sec
********* Start testing of DialogNativeTest *********
Config: Using QtTest library 5.15.8, Qt 5.15.8 (x86_64-little_endian-lp64 shared (dynamic) release build; by GCC 13.0.1 20230324 (Red Hat 13.0.1-0)), fedora 39
WARNING: DialogNativeTest::initTestCase() testdata ../src/desktoptheme/breeze/colors could not be located!
   Loc: [/home/tkloczko/rpmbuild/BUILD/plasma-framework-5.105.0/autotests/utils.h(51)]
PASS   : DialogNativeTest::initTestCase()
FAIL!  : DialogNativeTest::size() Compared values are not the same
   Actual   (m_dialog->height()): 111
   Expected (112)               : 112
   Loc: [/home/tkloczko/rpmbuild/BUILD/plasma-framework-5.105.0/autotests/dialognativetest.cpp(72)]
PASS   : DialogNativeTest::position()
PASS   : DialogNativeTest::cleanupTestCase()
Totals: 3 passed, 1 failed, 0 skipped, 0 blacklisted, 74ms
********* Finished testing of DialogNativeTest *********

 9/12 Test  #9: iconitemhidpitest ................   Passed    0.18 sec
10/12 Test  #6: plasma-themetest .................   Passed    1.06 sec
11/12 Test  #5: plasma-iconitemtest ..............***Failed    1.47 sec
********* Start testing of IconItemTest *********
Config: Using QtTest library 5.15.8, Qt 5.15.8 (x86_64-little_endian-lp64 shared (dynamic) release build; by GCC 13.0.1 20230324 (Red Hat 13.0.1-0)), fedora 39
WARNING: IconItemTest::initTestCase() testdata ../src/desktoptheme/breeze/colors could not be located!
   Loc: [/home/tkloczko/rpmbuild/BUILD/plasma-framework-5.105.0/autotests/utils.h(51)]
PASS   : IconItemTest::initTestCase()
PASS   : IconItemTest::loadPixmap()
PASS   : IconItemTest::loadImage()
PASS   : IconItemTest::invalidIcon()
PASS   : IconItemTest::usesPlasmaTheme()
FAIL!  : IconItemTest::animation() 'userAwayImg != waitAndGrabImage(item1)' returned FALSE. ()
   Loc: [/home/tkloczko/rpmbuild/BUILD/plasma-framework-5.105.0/autotests/iconitemtest.cpp(243)]
FAIL!  : IconItemTest::animationAfterHide() 'userBusyImg != waitAndGrabImage(item1)' returned FALSE. ()
   Loc: [/home/tkloczko/rpmbuild/BUILD/plasma-framework-5.105.0/autotests/iconitemtest.cpp(277)]
SKIP   : IconItemTest::bug_359388() hicolor icon theme not available
   Loc: [/home/tkloczko/rpmbuild/BUILD/plasma-framework-5.105.0/autotests/iconitemtest.cpp(284)]
PASS   : IconItemTest::loadSvg()
PASS   : IconItemTest::themeChange()
PASS   : IconItemTest::qiconFromTheme()
PASS   : IconItemTest::changeColorGroup()
FAIL!  : IconItemTest::animatingActiveChange() 'img1 != img2' returned FALSE. ()
   Loc: [/home/tkloczko/rpmbuild/BUILD/plasma-framework-5.105.0/autotests/iconitemtest.cpp(413)]
FAIL!  : IconItemTest::animatingEnabledChange() 'img1 != img2' returned FALSE. ()
   Loc: [/home/tkloczko/rpmbuild/BUILD/plasma-framework-5.105.0/autotests/iconitemtest.cpp(432)]
PASS   : IconItemTest::windowChanged()
PASS   : IconItemTest::paintedSize()
PASS   : IconItemTest::implicitSize()
PASS   : IconItemTest::nonSquareImplicitSize()
PASS   : IconItemTest::roundToIconSize()
PASS   : IconItemTest::cleanupTestCase()
Totals: 15 passed, 4 failed, 1 skipped, 0 blacklisted, 1359ms
********* Finished testing of IconItemTest *********

12/12 Test  #2: plasma-dialogstatetest ...........***Failed    5.18 sec
********* Start testing of DialogStateTest *********
Config: Using QtTest library 5.15.8, Qt 5.15.8 (x86_64-little_endian-lp64 shared (dynamic) release build; by GCC 13.0.1 20230324 (Red Hat 13.0.1-0)), fedora 39
QWARN  : DialogStateTest::initTestCase() kf.plasma.core: Could not locate plasma theme "default" in plasma/desktoptheme/ using search path ("/home/tkloczko/.local/share", "/usr/local/share", "/usr/share")
QWARN  : DialogStateTest::initTestCase() kf.plasma.core: Could not locate plasma theme "default" in plasma/desktoptheme/ using search path ("/home/tkloczko/.local/share", "/usr/local/share", "/usr/share")
PASS   : DialogStateTest::initTestCase()
FAIL!  : DialogStateTest::windowState() 'windowAddedSpy.wait()' returned FALSE. ()
   Loc: [/home/tkloczko/rpmbuild/BUILD/plasma-framework-5.105.0/autotests/dialogstatetest.cpp(39)]
PASS   : DialogStateTest::cleanupTestCase()
Totals: 2 passed, 1 failed, 0 skipped, 0 blacklisted, 5067ms
********* Finished testing of DialogStateTest *********


75% tests passed, 3 tests failed out of 12

Total Test time (real) =   5.19 sec

The following tests FAILED:
          2 - plasma-dialogstatetest (Failed)
          5 - plasma-iconitemtest (Failed)
          8 - dialognativetest (Failed)
Errors while running CTest
Comment 4 David Edmundson 2023-12-13 10:50:54 UTC
All CI is passing